Difference between revisions of "Talk:Fedora 17 Installation Guide"

From cchtml.com
Jump to: navigation, search
(Page out of date not working in Fedora 17)
 
Line 41: Line 41:
 
== Page out of date not working in Fedora 17 ==
 
== Page out of date not working in Fedora 17 ==
 
Should review!
 
Should review!
 +
the help on this page does not work and is out of date dos not install in fedora 17
 
----------------------
 
----------------------
  
 
This procedure does work for me correctly on Fedora 17 x86_64.
 
This procedure does work for me correctly on Fedora 17 x86_64.
 +
 
Proc: AMD A6-4400M APU with Radeon(tm) HD Graphics   
 
Proc: AMD A6-4400M APU with Radeon(tm) HD Graphics   
 +
 
Graphic card: AMD Radeon HD 7520G
 
Graphic card: AMD Radeon HD 7520G
Driver's version: Catalyst 12.10
 
  
the help on this page does not work and is out of date dos not install in fedora 17
+
Driver's version: Catalyst 12.10

Latest revision as of 11:21, 9 January 2013

TALK PAGES ARE NOT SUPPORT FORUMS

If you require help with installing the AMD fglrx driver, please consider a web forum or mailing list.

Should review this!


Procedure not working.

I'm running Fedora 17 (3.4.3-1.fc17.i686 #1 SMP) with an ATI Radeon HD 3800 card. I did as instructed and this happened:

# ./fglrx/common/lib/modules/fglrx/build_mod/make.sh
AMD kernel module generator version 2.1
./fglrx/common/lib/modules/fglrx/build_mod/make.sh: line 390: [: =: unary operator expected
doing Makefile based build for kernel 2.6.x and higher
./fglrx/common/lib/modules/fglrx/build_mod/make.sh: line 462: cd: 2.6.x: No such file or directory
make: *** No rule to make target `clean'. Stop.
make: *** No targets specified and no makefile found. Stop.
build failed with return value 2

so I changed directory and tried again and this happened:

# cd ./fglrx/common/lib/modules/fglrx/build_mod
# sudo ./make.sh
AMD kernel module generator version 2.1
./make.sh: line 390: [: =: unary operator expected
doing Makefile based build for kernel 2.6.x and higher
rm -rf *.c *.h *.o *.ko *.a .??* *.symvers
make -C /lib/modules/3.4.3-1.fc17.i686/build SUBDIRS=/home/peniwize/Downloads/fglrx/common/lib/modules/fglrx/build_mod/2.6.x modules
make[1]: Entering directory `/usr/src/kernels/3.4.3-1.fc17.i686'
  CC [M] /home/peniwize/Downloads/fglrx/common/lib/modules/fglrx/build_mod/2.6.x/firegl_public.o
/home/peniwize/Downloads/fglrx/common/lib/modules/fglrx/build_mod/2.6.x/firegl_public.c: In function ‘KCL_fpu_begin’:
/home/peniwize/Downloads/fglrx/common/lib/modules/fglrx/build_mod/2.6.x/firegl_public.c:5812:28: error: ‘TS_USEDFPU’ undeclared (first use in this function)
/home/peniwize/Downloads/fglrx/common/lib/modules/fglrx/build_mod/2.6.x/firegl_public.c:5812:28: note: each undeclared identifier is reported only once for each function it appears in
/home/peniwize/Downloads/fglrx/common/lib/modules/fglrx/build_mod/2.6.x/firegl_public.c:5813:9: error: implicit declaration of function ‘__save_init_fpu’ [-Werror=implicit-function-declaration]
cc1: some warnings being treated as errors
make[2]: *** [/home/peniwize/Downloads/fglrx/common/lib/modules/fglrx/build_mod/2.6.x/firegl_public.o] Error 1
make[1]: *** [_module_/home/peniwize/Downloads/fglrx/common/lib/modules/fglrx/build_mod/2.6.x] Error 2
make[1]: Leaving directory `/usr/src/kernels/3.4.3-1.fc17.i686'
make: *** [kmod_build] Error 2
build failed with return value 2

Page out of date not working in Fedora 17[edit]

Should review! the help on this page does not work and is out of date dos not install in fedora 17


This procedure does work for me correctly on Fedora 17 x86_64.

Proc: AMD A6-4400M APU with Radeon(tm) HD Graphics

Graphic card: AMD Radeon HD 7520G

Driver's version: Catalyst 12.10